BDBM50394492 CHEMBL1765471
SMILES OC[C@@H]1[C@@H](O)[C@H](O)[C@@H](O)c2nc(CCc3ccc(cc3)-c3ccccc3)cn12
InChI Key InChIKey=XDPKQPFTXHEYSP-MXEMCNAFSA-N
Data  2 KI
  Tab Delimited (TSV)   2D SDfile   Computed 3D by Vconf -m prep SDfile
Find this compound or compounds like it in BindingDB:
Activity Spreadsheet -- Enzyme Inhibition Constant Data from BindingDB
Found 2 hits for monomerid = 50394492
TargetProtein O-GlcNAcase(Homo sapiens (Human))
Nankai University
Curated by ChEMBL
LigandPNGBDBM50394492(CHEMBL1765471)
Affinity DataKi:  5.90E+3nM. Assay description: Competitive inhibition of human OGA using 4-MU-GlcNAc as substrate after 10 mins by Lineweaver Burk plot analysis
In DepthDetails ArticlePubMed
TargetBeta-hexosaminidase subunit alpha(Homo sapiens (Human))
Nankai University
Curated by ChEMBL
LigandPNGBDBM50394492(CHEMBL1765471)
Affinity DataKi:  1.63E+5nM. Assay description: Inhibition of human Hex A using 4-MU-GlcNAc as substrate after 10 mins by Lineweaver Burk plot analysis
In DepthDetails ArticlePubMed