BDBM50394612 CHEMBL2164581
SMILES CC(C)(C)c1ccc(cc1)S(=O)(=O)N1Cc2ccc(nc2Nc2cccc(-c3noc(CO)n3)c12)C(F)(F)F
InChI Key InChIKey=FWWAWJWEAANSPV-UHFFFAOYSA-N
Data  1 IC50  3 EC50
  Tab Delimited (TSV)   2D SDfile   Computed 3D by Vconf -m prep SDfile
Find this compound or compounds like it in BindingDB:
Activity Spreadsheet -- Enzyme Inhibition Constant Data from BindingDB
Found 4 hits for monomerid = 50394612
TargetBombesin receptor subtype-3(Mus musculus)
TBA
Curated by ChEMBL
LigandPNGBDBM50394612(CHEMBL2164581)
Affinity DataEC50:  93nM. Assay description: Agonist activity at mouse BRS-3 expressed in HEK293AEQ cells assessed as bioluminescence for 10 mins by aequorin bioluminescence assay
In DepthDetails ArticlePubMed
TargetNuclear receptor subfamily 1 group I member 2(Homo sapiens (Human))
TBA
Curated by ChEMBL
LigandPNGBDBM50394612(CHEMBL2164581)
Affinity DataEC50:  3.50E+3nM. Assay description: Activation of PXR
In DepthDetails ArticlePubMed
TargetBombesin receptor subtype-3(Homo sapiens (Human))
TBA
Curated by ChEMBL
LigandPNGBDBM50394612(CHEMBL2164581)
Affinity DataIC50:  0.700nM. Assay description: Displacement of [125I]-dY-peptide from human BRS-3 expressed in NFAT-CHO cells after 2 hrs by by liquid scintillation counting
In DepthDetails ArticlePubMed
TargetBombesin receptor subtype-3(Homo sapiens (Human))
TBA
Curated by ChEMBL
LigandPNGBDBM50394612(CHEMBL2164581)
Affinity DataEC50:  56nM. Assay description: Agonist activity at human BRS-3 expressed in HEK293AEQ cells assessed as bioluminescence for 10 mins by aequorin bioluminescence assay
In DepthDetails ArticlePubMed