BDBM50394850 CHEMBL2165013::US8772480, 41
SMILES COc1ccc(Nc2ncc(CN3CCNCC3)cc2-c2nc(C)nc(N)n2)cn1
InChI Key InChIKey=KEDQOULNSHVTKP-UHFFFAOYSA-N
Data  5 KI  2 IC50
  Tab Delimited (TSV)   2D SDfile   Computed 3D by Vconf -m prep SDfile
Find this compound or compounds like it in BindingDB:
Activity Spreadsheet -- Enzyme Inhibition Constant Data from BindingDB
Found 7 hits for monomerid = 50394850
LigandPNGBDBM50394850(CHEMBL2165013 | US8772480, 41)
Affinity DataKi:  17nM. Assay description: Inhibition of human N-terminal poly-His tagged-PI3Kbeta expressed in Sf9 baculovirus system co-expressing p85alpha after 20 mins by AlphaScreen assay
In DepthDetails ArticlePubMed
LigandPNGBDBM50394850(CHEMBL2165013 | US8772480, 41)
Affinity DataKi:  27nM. Assay description: Inhibition of human N-terminal poly-His tagged-PI3Kdelta expressed in Sf9 baculovirus system co-expressing p85alpha after 20 mins by AlphaScreen assa...
In DepthDetails ArticlePubMed
LigandPNGBDBM50394850(CHEMBL2165013 | US8772480, 41)
Affinity DataKi:  61nM. Assay description: Inhibition of human N-terminal poly-His tagged-PI3Kalpha expressed in Sf9 baculovirus system co-expressing p85alpha after 20 mins by AlphaScreen assa...
In DepthDetails ArticlePubMed
LigandPNGBDBM50394850(CHEMBL2165013 | US8772480, 41)
Affinity DataKi:  61nM. Assay description: The PI3K AlphaScreen assay (PerkinElmer, Waltham, Mass.) measures the activity of a panel of four phosphoinositide 3-kinases: PI3Kalpha, PI3Kbeta, PI...
In DepthDetails US Patent
LigandPNGBDBM50394850(CHEMBL2165013 | US8772480, 41)
Affinity DataKi:  200nM. Assay description: Inhibition of human N-terminal poly-His tagged-PI3Kgamma expressed in Sf9 baculovirus system co-expressing p85alpha after 20 mins by AlphaScreen assa...
In DepthDetails ArticlePubMed
TargetSerine/threonine-protein kinase mTOR(Homo sapiens (Human))
Amgen
Curated by ChEMBL
LigandPNGBDBM50394850(CHEMBL2165013 | US8772480, 41)
Affinity DataIC50: >1.00E+4nM. Assay description: Inhibition of recombinant GST-tagged mTOR-mediated 4EBP1 phosphorylation after 90 mins by FRET assay
In DepthDetails ArticlePubMed
TargetSerine/threonine-protein kinase mTOR(Homo sapiens (Human))
Amgen
Curated by ChEMBL
LigandPNGBDBM50394850(CHEMBL2165013 | US8772480, 41)
Affinity DataIC50: >1.00E+4nM. Assay description: The Invitrogen (Carlsbad, Calif.) mammalian target of rapamycin (mTOR) Lanthascreen assay can be used to quantitate mTOR kinase activity in an in vit...
In DepthDetails US Patent