BDBM50395046 CHEMBL2163853
SMILES C[C@H](Cn1nncc1CCCCn1ccc(=O)[nH]c1=O)c1cccc(OCC2CC2)c1
InChI Key InChIKey=ICTFRAJLVSTQHM-QGZVFWFLSA-N
Data  1 IC50
  Tab Delimited (TSV)   2D SDfile   Computed 3D by Vconf -m prep SDfile
Find this compound or compounds like it in BindingDB:
Activity Spreadsheet -- Enzyme Inhibition Constant Data from BindingDB
Found 1 hit for monomerid = 50395046
TargetDeoxyuridine 5'-triphosphate nucleotidohydrolase, mitochondrial(Homo sapiens (Human))
Taiho Pharmaceutical
Curated by ChEMBL
LigandPNGBDBM50395046(CHEMBL2163853)
Affinity DataIC50:  870nM. Assay description: Inhibition of human dUTPase assessed as reduction in [5-3H]dUMP production incubated for 15 mins by HPLC
In DepthDetails ArticlePubMed