BDBM50395150 CHEMBL2163571
SMILES CCC1COc2c(ccc3c2n1cc(C(=O)NC12CC4CC(CC(C4)C1)C2)c3=O)N1CCCC1
InChI Key InChIKey=AQFXWTYTJAHYTB-UHFFFAOYSA-N
Data  4 KI  1 IC50
  Tab Delimited (TSV)   2D SDfile   Computed 3D by Vconf -m prep SDfile
Find this compound or compounds like it in BindingDB:
Activity Spreadsheet -- Enzyme Inhibition Constant Data from BindingDB
Found 5 hits for monomerid = 50395150
TargetCannabinoid receptor 2(Homo sapiens (Human))
Universit£
Curated by ChEMBL
LigandPNGBDBM50395150(CHEMBL2163571)
Affinity DataKi:  8.12nM. Assay description: Displacement of [3H]CP-55940 from human recombinant CB2 receptor expressed in CHO cell membranes incubated for 60 mins by scintillation counting
In DepthDetails ArticlePubMed
TargetCannabinoid receptor 2(Rattus norvegicus (Rat))
Universit£
Curated by ChEMBL
LigandPNGBDBM50395150(CHEMBL2163571)
Affinity DataKi:  10.5nM. Assay description: Displacement of [3H]CP-55940 from CB2 receptor in Sprague-Dawley rat spleen by scintillation counting
In DepthDetails ArticlePubMed
TargetCannabinoid receptor 1(Rattus norvegicus (rat))
Universit£
Curated by ChEMBL
LigandPNGBDBM50395150(CHEMBL2163571)
Affinity DataKi: >1.00E+4nM. Assay description: Displacement of [3H]CP-55940 from CB1 receptor in Sprague-Dawley rat brain by scintillation counting
In DepthDetails ArticlePubMed
TargetCannabinoid receptor 1(Homo sapiens (Human))
Universit£
Curated by ChEMBL
LigandPNGBDBM50395150(CHEMBL2163571)
Affinity DataKi: >1.00E+4nM. Assay description: Displacement of [3H]CP-55940 from human recombinant CB1 receptor expressed in CHO cell membranes incubated for 90 mins by scintillation counting
In DepthDetails ArticlePubMed
TargetCannabinoid receptor 2(Homo sapiens (Human))
Universit£
Curated by ChEMBL
LigandPNGBDBM50395150(CHEMBL2163571)
Affinity DataIC50:  29nM. Assay description: Agonist activity at human recombinant CB2 receptor expressed in CHO cell membranes assessed as inhibition of forskolin-induced cAMP accumulation
In DepthDetails ArticlePubMed