BDBM50395334 CHEMBL2164388
SMILES COc1ccc(CNC(=O)C2N(CCc3ccccn3)C(=O)c3ccccc23)cc1
InChI Key InChIKey=PYZXYYJWHQKGCD-UHFFFAOYSA-N
Data  2 IC50
  Tab Delimited (TSV)   2D SDfile   Computed 3D by Vconf -m prep SDfile
Find this compound or compounds like it in BindingDB:
Activity Spreadsheet -- Enzyme Inhibition Constant Data from BindingDB
Found 2 hits for monomerid = 50395334
TargetSodium channel protein type 9 subunit alpha(Homo sapiens (Human))
Astrazeneca
Curated by ChEMBL
LigandPNGBDBM50395334(CHEMBL2164388)
Affinity DataIC50:  1.60E+3nM. Assay description: Inhibition of recombinant human NaV1.7 alpha subunit expressed in HEK293 cells at -65 mV holding potential by patch clamp electrophysiological assay
In DepthDetails ArticlePubMed
TargetSodium channel protein type 5 subunit alpha(Homo sapiens (Human))
Astrazeneca
Curated by ChEMBL
LigandPNGBDBM50395334(CHEMBL2164388)
Affinity DataIC50: >2.30E+4nM. Assay description: Inhibition of human NaV1.5 alpha subunit expressed in CHOK1 cells at -90 mV holding potential by patch clamp electrophysiological assay
In DepthDetails ArticlePubMed