BDBM50395594 CHEMBL2165310
SMILES COc1ccc(OP(=O)(Oc2ccc(OC)cc2)C(CCC(N)=O)NC(=O)C(CC(C)C)NC(=O)C(CCC(N)=O)NC(=O)OCc2ccccc2)cc1
InChI Key InChIKey=VFTGGLHRTWDYRB-UHFFFAOYSA-N
Data  1 KI
  Tab Delimited (TSV)   2D SDfile   Computed 3D by Vconf -m prep SDfile
Find this compound or compounds like it in BindingDB:
Activity Spreadsheet -- Enzyme Inhibition Constant Data from BindingDB
Found 1 hit for monomerid = 50395594
TargetSerine protease SplB(Staphylococcus aureus)
Wroclaw University Of Technology
Curated by ChEMBL
LigandPNGBDBM50395594(CHEMBL2165310)
Affinity DataKi:  1.60E+4nM. Assay description: Inhibition of Staphylococcus aureus SplB using fluorogenic Ac-Tro-Glu-Leu-Gln-ACC as substrate by spectrofluorometry
In DepthDetails ArticlePubMed