BDBM50395597 CHEMBL2165307
SMILES CC(C)CC(NC(=O)OCc1ccccc1)C(=O)NC(CCC(N)=O)P(=O)(Oc1ccc(cc1)C(C)(C)C)Oc1ccc(cc1)C(C)(C)C
InChI Key InChIKey=KIFRAEWIEMUEKP-UHFFFAOYSA-N
Data  1 KI
  Tab Delimited (TSV)   2D SDfile   Computed 3D by Vconf -m prep SDfile
Find this compound or compounds like it in BindingDB:
Activity Spreadsheet -- Enzyme Inhibition Constant Data from BindingDB
Found 1 hit for monomerid = 50395597
TargetSerine protease SplB(Staphylococcus aureus)
Wroclaw University Of Technology
Curated by ChEMBL
LigandPNGBDBM50395597(CHEMBL2165307)
Affinity DataKi: >2.00E+5nM. Assay description: Inhibition of Staphylococcus aureus SplB using fluorogenic Ac-Tro-Glu-Leu-Gln-ACC as substrate by spectrofluorometry
In DepthDetails ArticlePubMed