BDBM50396055 CHEMBL2170193
SMILES CCOC(=O)CC(=O)NCCCC[C@H](NC(=O)OCc1ccccc1)C(=O)Nc1ccccc1
InChI Key InChIKey=ZPHWSTHBADVSGT-NRFANRHFSA-N
Data  3 IC50
  Tab Delimited (TSV)   2D SDfile   Computed 3D by Vconf -m prep SDfile
Find this compound or compounds like it in BindingDB:
Activity Spreadsheet -- Enzyme Inhibition Constant Data from BindingDB
Found 3 hits for monomerid = 50396055
TargetNAD-dependent protein deacetylase sirtuin-3, mitochondrial(Homo sapiens (Human))
Sirtris A Gsk
Curated by ChEMBL
LigandPNGBDBM50396055(CHEMBL2170193)
Affinity DataIC50: >3.00E+5nM. Assay description: Inhibition of SIRT3
In DepthDetails ArticlePubMed
TargetNAD-dependent protein deacetylase sirtuin-1(Homo sapiens (Human))
Sirtris A Gsk
Curated by ChEMBL
LigandPNGBDBM50396055(CHEMBL2170193)
Affinity DataIC50:  4.00E+3nM. Assay description: Inhibition of SIRT1
In DepthDetails ArticlePubMed
TargetNAD-dependent protein deacetylase sirtuin-2(Homo sapiens (Human))
Sirtris A Gsk
Curated by ChEMBL
LigandPNGBDBM50396055(CHEMBL2170193)
Affinity DataIC50:  6.50E+4nM. Assay description: Inhibition of SIRT2
In DepthDetails ArticlePubMed