BDBM50396285 CHEMBL2172461
SMILES [#6]-[#8]-[#6]-[#6](-[#8])-[#6]-[#7]-[#6](=O)-[#8]\[#7]=[#6]-1\[#6]-[#6]-[#6]-[#6]-[#6]-1
InChI Key InChIKey=AFTHCBHCLSBWPM-UHFFFAOYSA-N
Data  3 KI
  Tab Delimited (TSV)   2D SDfile   Computed 3D by Vconf -m prep SDfile
Find this compound or compounds like it in BindingDB:
Activity Spreadsheet -- Enzyme Inhibition Constant Data from BindingDB
Found 3 hits for monomerid = 50396285
TargetCannabinoid receptor 2(Homo sapiens (Human))
Northeastern University
Curated by ChEMBL
LigandPNGBDBM50396285(CHEMBL2172461)
Affinity DataKi: >1.00E+3nM. Assay description: Displacement of [3H]CP55940 from human CB2 receptor expressed in HEK293 cells
In DepthDetails ArticlePubMed
TargetCannabinoid receptor 1(Rattus norvegicus (rat))
Northeastern University
Curated by ChEMBL
LigandPNGBDBM50396285(CHEMBL2172461)
Affinity DataKi: >1.00E+3nM. Assay description: Displacement of [3H]CP55940 from CB1 receptor in rat brain synaptosome membrane
In DepthDetails ArticlePubMed
TargetCannabinoid receptor 2(MOUSE)
Northeastern University
Curated by ChEMBL
LigandPNGBDBM50396285(CHEMBL2172461)
Affinity DataKi: >1.00E+3nM. Assay description: Displacement of [3H]CP55940 from CB2 receptor in mouse spleen membrane
In DepthDetails ArticlePubMed