BDBM50396376 CHEMBL2170225
SMILES Cc1cc(OCCN2CCOCC2)nn1-c1ccc(Cl)c(Cl)c1
InChI Key InChIKey=HLAPBHGJHLAYSD-UHFFFAOYSA-N
Data  1 KI  1 IC50
  Tab Delimited (TSV)   2D SDfile   Computed 3D by Vconf -m prep SDfile
Find this compound or compounds like it in BindingDB:
Activity Spreadsheet -- Enzyme Inhibition Constant Data from BindingDB
Found 2 hits for monomerid = 50396376
TargetSigma non-opioid intracellular receptor 1(Homo sapiens (Human))
Esteve
Curated by ChEMBL
LigandPNGBDBM50396376(CHEMBL2170225)
Affinity DataKi:  10.8nM. Assay description: Displacement of [3H](+)pentazocine from human sigma 1 receptor transfected in HEK293 cell membranes after 120 mins by scintillation counter
In DepthDetails ArticlePubMed
TargetPotassium voltage-gated channel subfamily H member 2(Homo sapiens (Human))
Esteve
Curated by ChEMBL
LigandPNGBDBM50396376(CHEMBL2170225)
Affinity DataIC50:  3.50E+3nM. Assay description: Inhibition of human ERG transfected in HEK293 cell membranes by whole cell patch clamp assay
In DepthDetails ArticlePubMed