BDBM50396381 CHEMBL2170222
SMILES Cc1cc(OCCCCN2CCCC2)nn1-c1ccc(Cl)c(Cl)c1
InChI Key InChIKey=LUAPJOUYJPEKMR-UHFFFAOYSA-N
Data  1 KI
  Tab Delimited (TSV)   2D SDfile   Computed 3D by Vconf -m prep SDfile
Find this compound or compounds like it in BindingDB:
Activity Spreadsheet -- Enzyme Inhibition Constant Data from BindingDB
Found 1 hit for monomerid = 50396381
TargetSigma non-opioid intracellular receptor 1(Homo sapiens (Human))
Esteve
Curated by ChEMBL
LigandPNGBDBM50396381(CHEMBL2170222)
Affinity DataKi:  6.90nM. Assay description: Displacement of [3H](+)pentazocine from human sigma 1 receptor transfected in HEK293 cell membranes after 120 mins by scintillation counter
In DepthDetails ArticlePubMed