BDBM50396385 CHEMBL2169891
SMILES Clc1ccc(cc1Cl)-n1ccc(OCCCN2CCOCC2)n1
InChI Key InChIKey=YACRZYIQUBCSTQ-UHFFFAOYSA-N
Data  1 KI
  Tab Delimited (TSV)   2D SDfile   Computed 3D by Vconf -m prep SDfile
Find this compound or compounds like it in BindingDB:
Activity Spreadsheet -- Enzyme Inhibition Constant Data from BindingDB
Found 1 hit for monomerid = 50396385
TargetSigma non-opioid intracellular receptor 1(Homo sapiens (Human))
Esteve
Curated by ChEMBL
LigandPNGBDBM50396385(CHEMBL2169891)
Affinity DataKi:  16.1nM. Assay description: Displacement of [3H](+)pentazocine from human sigma 1 receptor transfected in HEK293 cell membranes after 120 mins by scintillation counter
In DepthDetails ArticlePubMed