BDBM50396388 CHEMBL2170216
SMILES Cc1cc(OCCCN2CCOCC2)nn1-c1ccc(Cl)c(Cl)c1
InChI Key InChIKey=XGRBKTASRZCJDH-UHFFFAOYSA-N
Data  1 KI
  Tab Delimited (TSV)   2D SDfile   Computed 3D by Vconf -m prep SDfile
Find this compound or compounds like it in BindingDB:
Activity Spreadsheet -- Enzyme Inhibition Constant Data from BindingDB
Found 1 hit for monomerid = 50396388
TargetSigma non-opioid intracellular receptor 1(Homo sapiens (Human))
Esteve
Curated by ChEMBL
LigandPNGBDBM50396388(CHEMBL2170216)
Affinity DataKi:  18.9nM. Assay description: Displacement of [3H](+)pentazocine from human sigma 1 receptor transfected in HEK293 cell membranes after 120 mins by scintillation counter
In DepthDetails ArticlePubMed