BDBM50396666 CHEMBL2172095
SMILES OC(=O)c1cccc(c1)S(=O)(=O)NCCc1cccc(Cl)c1
InChI Key InChIKey=PLXFUYNMQRTZGO-UHFFFAOYSA-N
Data  7 IC50
  Tab Delimited (TSV)   2D SDfile   Computed 3D by Vconf -m prep SDfile
Find this compound or compounds like it in BindingDB:
Activity Spreadsheet -- Enzyme Inhibition Constant Data from BindingDB
Found 7 hits for monomerid = 50396666
TargetAldo-keto reductase family 1 member C3(Homo sapiens (Human))
University Of Auckland
Curated by ChEMBL
LigandPNGBDBM50396666(CHEMBL2172095)
Affinity DataIC50: >1.00E+3nM. Assay description: Inhibition of AKR1C3 overexpressed in human HCT116 cells assessed as inhibition of PR-104A conversion to hydroxylamine after 2 hrs by spectrophotomet...
In DepthDetails ArticlePubMed
TargetAldo-keto reductase family 1 member C4(Homo sapiens (Human))
University Of Auckland
Curated by ChEMBL
LigandPNGBDBM50396666(CHEMBL2172095)
Affinity DataIC50: >3.00E+4nM. Assay description: Inhibition of human recombinant N-terminal His6-tagged AKR1C4 expressed in Escherichia coli BL21(DE3) cells using 8-Acetyl-2,3,5,6-tetrahydro-1H,4H-1...
In DepthDetails ArticlePubMed
TargetAldo-keto reductase family 1 member C2(Homo sapiens (Human))
University Of Auckland
Curated by ChEMBL
LigandPNGBDBM50396666(CHEMBL2172095)
Affinity DataIC50: >3.00E+4nM. Assay description: Inhibition of human recombinant N-terminal His6-tagged AKR1C2 expressed in Escherichia coli BL21(DE3) cells using 8-Acetyl-2,3,5,6-tetrahydro-1H,4H-1...
In DepthDetails ArticlePubMed
TargetAldo-keto reductase family 1 member C3(Homo sapiens (Human))
University Of Auckland
Curated by ChEMBL
LigandPNGBDBM50396666(CHEMBL2172095)
Affinity DataIC50:  210nM. Assay description: Inhibition of human recombinant His-tagged AKR1C3 expressed in Escherichia coli BL21 (DE3) cells using 8-Acetyl-2,3,5,6-tetrahydro-1H,4H-11-oxa-3a-az...
In DepthDetails ArticlePubMed
TargetAldo-keto reductase family 1 member C1(Homo sapiens (Human))
University Of Auckland
Curated by ChEMBL
LigandPNGBDBM50396666(CHEMBL2172095)
Affinity DataIC50: >3.00E+4nM. Assay description: Inhibition of human recombinant N-terminal His6-tagged AKR1C1 expressed in Escherichia coli BL21(DE3) cells using 8-Acetyl-2,3,5,6-tetrahydro-1H,4H-1...
In DepthDetails ArticlePubMed
TargetAldo-keto reductase family 1 member C3(Homo sapiens (Human))
University Of Auckland
Curated by ChEMBL
LigandPNGBDBM50396666(CHEMBL2172095)
Affinity DataIC50:  209nM. Assay description: Inhibition of human recombinant His-tagged AKR1C3 expressed in Escherichia coli BL21 (DE3) cells using 8-Acetyl-2,3,5,6-tetrahydro-1H,4H-11-oxa-3a-az...
In DepthDetails ArticlePubMed
TargetAldo-keto reductase family 1 member C3(Homo sapiens (Human))
University Of Auckland
Curated by ChEMBL
LigandPNGBDBM50396666(CHEMBL2172095)
Affinity DataIC50:  210nM. Assay description: Inhibition of human recombinant N-terminal His6-tagged AKR1C3 expressed in Escherichia coli BL21(DE3) cells using 8-Acetyl-2,3,5,6-tetrahydro-1H,4H-1...
In DepthDetails ArticlePubMed