BDBM50396738 CHEMBL2172247
SMILES OC(=O)c1cccc(Nc2nc3ccccc3[nH]2)c1
InChI Key InChIKey=CKJQADZFMZAUTL-UHFFFAOYSA-N
Data  1 KI
  Tab Delimited (TSV)   2D SDfile   Computed 3D by Vconf -m prep SDfile
Find this compound or compounds like it in BindingDB:
Activity Spreadsheet -- Enzyme Inhibition Constant Data from BindingDB
Found 1 hit for monomerid = 50396738
TargetAldo-keto reductase family 1 member C3(Homo sapiens (Human))
University Of Ljubljana
Curated by ChEMBL
LigandPNGBDBM50396738(CHEMBL2172247)
Affinity DataKi:  1.42E+5nM. Assay description: Inhibition of human recombinant AKR1C3 assessed as 1-acenaphthenol oxidation by spectrophotometry
In DepthDetails ArticlePubMed