BDBM50397128 CHEMBL2172126
SMILES CC1(C)CN(CCN1C(=O)[C@@H]1CCCC[C@H]1C(=O)NC1(CC1)C#N)c1ccc(cc1)S(C)(=O)=O
InChI Key InChIKey=VMWCTYONHSDNMV-NHCUHLMSSA-N
Data  4 IC50
  Tab Delimited (TSV)   2D SDfile   Computed 3D by Vconf -m prep SDfile
Find this compound or compounds like it in BindingDB:
Activity Spreadsheet -- Enzyme Inhibition Constant Data from BindingDB
Found 4 hits for monomerid = 50397128
TargetCathepsin B(Homo sapiens (Human))
Astrazeneca
Curated by ChEMBL
LigandPNGBDBM50397128(CHEMBL2172126)
Affinity DataIC50:  3.51E+3nM. Assay description: Inhibition of human recombinant cathepsin-B using Z-Arg-Arg-AMC as substrate preincubated for 15 mins measured after 1 hr by QFRET assay
In DepthDetails ArticlePubMed
TargetProcathepsin L(Homo sapiens (Human))
Astrazeneca
Curated by ChEMBL
LigandPNGBDBM50397128(CHEMBL2172126)
Affinity DataIC50: >1.00E+4nM. Assay description: Inhibition of human recombinant cathepsin-L using Z-Phe-Arg-AMC as substrate preincubated for 15 mins measured after 1 hr by QFRET assay
In DepthDetails ArticlePubMed
TargetCathepsin K(Homo sapiens (Human))
Astrazeneca
Curated by ChEMBL
LigandPNGBDBM50397128(CHEMBL2172126)
Affinity DataIC50:  45nM. Assay description: Inhibition of human recombinant cathepsin-k using Z-Phe-Arg-AMC as substrate preincubated for 15 mins measured after 1 hr by QFRET assay
In DepthDetails ArticlePubMed
TargetCathepsin S(Homo sapiens (Human))
Astrazeneca
Curated by ChEMBL
LigandPNGBDBM50397128(CHEMBL2172126)
Affinity DataIC50:  3.75E+3nM. Assay description: Inhibition of human recombinant cathepsin-S using Z-Val-Val-Arg-AMC as substrate preincubated for 15 mins measured after 1 hr by QFRET assay
In DepthDetails ArticlePubMed