BDBM50397704 CHEMBL2181910
SMILES CCOCC(=O)N[C@@H](Cc1cccc(c1)-c1nccs1)[C@H](O)CN[C@H]1CC2(CCC2)Oc2ncc(CC(C)(C)C)cc12
InChI Key InChIKey=XLZMPDBDSOQRLV-HZFUHODCSA-N
Data  2 IC50
  Tab Delimited (TSV)   2D SDfile   Computed 3D by Vconf -m prep SDfile
Find this compound or compounds like it in BindingDB:
Activity Spreadsheet -- Enzyme Inhibition Constant Data from BindingDB
Found 2 hits for monomerid = 50397704
TargetBeta-secretase 1(Homo sapiens (Human))
Amgen
Curated by ChEMBL
LigandPNGBDBM50397704(CHEMBL2181910)
Affinity DataIC50:  8.10nM. Assay description: Inhibition of BACE1 in human HEK293 cells expressing APP Swedish mutant assessed as inhibition of amyloid beta 40 production after overnight incubati...
In DepthDetails ArticlePubMed
TargetBeta-secretase 1(Homo sapiens (Human))
Amgen
Curated by ChEMBL
LigandPNGBDBM50397704(CHEMBL2181910)
Affinity DataIC50:  5.70nM. Assay description: Inhibition of human recombinant BACE1 using Glu-Ile-Asp-Leu-Met-Val-Leu-Asp as substrate incubated for 60 mins prior to substrate addition measured a...
In DepthDetails ArticlePubMed