BDBM50397774 CHEMBL2177189::US9296736, 128
SMILES CC[C@H](N1[C@@H]([C@H](C[C@](C)(Cc2nnn[nH]2)C1=O)c1cccc(Cl)c1)c1ccc(Cl)cc1)C(=O)OC(C)(C)C
InChI Key InChIKey=JJARPYJBPOGMTN-YEPCPMPXSA-N
Data  3 IC50
  Tab Delimited (TSV)   2D SDfile   Computed 3D by Vconf -m prep SDfile
Find this compound or compounds like it in BindingDB:
Activity Spreadsheet -- Enzyme Inhibition Constant Data from BindingDB
Found 3 hits for monomerid = 50397774
LigandPNGBDBM50397774(CHEMBL2177189 | US9296736, 128)
Affinity DataIC50:  10nMpH: 7.4 T: 2°C. Assay description: The standard assay conditions for the in vitro HTRF assay consisted of a 50 ul total reaction volume in black 384-well Costar polypropylene plates in...
In DepthDetails US Patent
TargetCellular tumor antigen p53(Homo sapiens (Human))
Amgen
Curated by ChEMBL
LigandPNGBDBM50397774(CHEMBL2177189 | US9296736, 128)
Affinity DataIC50:  1.60E+3nM. Assay description: Activity at p53 in human SJSA1 cells assessed as induction of p21 mRNA expression after 7 hrs by qRT-PCR analysis in presence of 10% human serum
In DepthDetails ArticlePubMed
LigandPNGBDBM50397774(CHEMBL2177189 | US9296736, 128)
Affinity DataIC50:  1nMpH: 7.4 T: 2°C. Assay description: The standard assay conditions for the in vitro HTRF assay consisted of a 50 ul total reaction volume in black 384-well Costar polypropylene plates in...
In DepthDetails US Patent