BDBM50397801 CHEMBL2177846
SMILES CC(C)(C)c1cccc(c1)-n1c(nc2cccnc12)-c1cccnc1N
InChI Key InChIKey=XBELLRYPERHLCM-UHFFFAOYSA-N
Data  1 IC50
  Tab Delimited (TSV)   2D SDfile   Computed 3D by Vconf -m prep SDfile
Find this compound or compounds like it in BindingDB:
Activity Spreadsheet -- Enzyme Inhibition Constant Data from BindingDB
Found 1 hit for monomerid = 50397801
TargetRAC-alpha serine/threonine-protein kinase(Homo sapiens (Human))
Arqule
Curated by ChEMBL
LigandPNGBDBM50397801(CHEMBL2177846)
Affinity DataIC50: >3.00E+5nM. Assay description: Inhibition of Akt1 (1 to 480) expressed in Sf9 cells using biotin-GRPRTSSFAEG as substrate after 20 mins by Alpha-screen assay
In DepthDetails ArticlePubMed