BDBM50397888 CHEMBL2179531
SMILES Clc1ccoc1C(=O)N1CC2CNCC2C1
InChI Key InChIKey=XXKYVKOMLITFKH-UHFFFAOYSA-N
Data  4 KI  1 EC50
  Tab Delimited (TSV)   2D SDfile   Computed 3D by Vconf -m prep SDfile
Find this compound or compounds like it in BindingDB:
Activity Spreadsheet -- Enzyme Inhibition Constant Data from BindingDB
Found 5 hits for monomerid = 50397888
TargetNeuronal acetylcholine receptor subunit alpha-4/beta-2(Homo sapiens (Human))
Targacept
Curated by ChEMBL
LigandPNGBDBM50397888(CHEMBL2179531)
Affinity DataKi:  2nM. Assay description: Displacement of [3H]nicotine from alpha4beta2 nAChR in human SH-EP1 cells after 2 hrs by liquid scintillation assay
In DepthDetails ArticlePubMed
TargetNeuronal acetylcholine receptor subunit alpha-4(Homo sapiens (Human))
Targacept
US Patent
LigandPNGBDBM50397888(CHEMBL2179531)
Affinity DataKi:  2.40nM ΔG°:  -11.6kcal/moleT: 2°C. Assay description: The binding of [3H]MLA was measured using a modification of the methods of Davies et al., Neuropharmacol. 38: 679 (1999). [3H]MLA (Specific Activity=...
In DepthDetails US Patent
TargetNeuronal acetylcholine receptor subunit alpha-4(Rattus norvegicus (Rat))
Targacept
US Patent
LigandPNGBDBM50397888(CHEMBL2179531)
Affinity DataKi:  2.80nM ΔG°:  -11.5kcal/moleT: 2°C. Assay description: The binding of [3H]MLA was measured using a modification of the methods of Davies et al., Neuropharmacol. 38: 679 (1999). [3H]MLA (Specific Activity=...
In DepthDetails US Patent
TargetNeuronal acetylcholine receptor subunit alpha-7(Homo sapiens (Human))
Targacept
Curated by ChEMBL
LigandPNGBDBM50397888(CHEMBL2179531)
Affinity DataKi:  2.60E+3nM. Assay description: Displacement of [3H]epibatidine from human alpha7 nAChR expressed in CHO cells after 2 hrs by liquid scintillation counting
In DepthDetails ArticlePubMed
TargetNeuronal acetylcholine receptor subunit alpha-4/beta-2(Homo sapiens (Human))
Targacept
Curated by ChEMBL
LigandPNGBDBM50397888(CHEMBL2179531)
Affinity DataEC50:  1.70E+4nM. Assay description: Agonist activity at alpha4beta2 nAChR in human SH-EP1 cells assessed as calcium flux by calcium4-based FLIPR assay
In DepthDetails ArticlePubMed