BDBM50397956 CHEMBL2179974
SMILES N=C1CCc2ccccc2C(Cc2ccccc2)C1=O
InChI Key InChIKey=YJJVBSCYMFTGJO-UHFFFAOYSA-N
Data  2 KI
  Tab Delimited (TSV)   2D SDfile   Computed 3D by Vconf -m prep SDfile
Find this compound or compounds like it in BindingDB:
Activity Spreadsheet -- Enzyme Inhibition Constant Data from BindingDB
Found 2 hits for monomerid = 50397956
TargetAminopeptidase N(Sus scrofa (Pig))
Universit£
Curated by ChEMBL
LigandPNGBDBM50397956(CHEMBL2179974)
Affinity DataKi:  8.00E+4nM. Assay description: Competitive inhibition of pig APN using L-leucine-p-nitroanilide as substrate by Dixon-plot analysis
In DepthDetails ArticlePubMed
TargetLeukotriene A-4 hydrolase(Homo sapiens (Human))
Universit£
Curated by ChEMBL
LigandPNGBDBM50397956(CHEMBL2179974)
Affinity DataKi:  3.80E+5nM. Assay description: Competitive inhibition of human recombinant LTA4H using alanine-p-nitroanilide as substrate by Dixon-plot analysis
In DepthDetails ArticlePubMed