BDBM50398183 CHEMBL2182106
SMILES CC(C)(C)c1ccc(cc1)C(=O)Nc1cc(Nc2ccc3c(CCCCC3=O)c2)ccc1F
InChI Key InChIKey=HWYSYZLDBKHUKX-UHFFFAOYSA-N
Data  1 IC50
  Tab Delimited (TSV)   2D SDfile   Computed 3D by Vconf -m prep SDfile
Find this compound or compounds like it in BindingDB:
Activity Spreadsheet -- Enzyme Inhibition Constant Data from BindingDB
Found 1 hit for monomerid = 50398183
TargetMitogen-activated protein kinase 14(Homo sapiens (Human))
Eberhard Karls University T£Bingen
Curated by ChEMBL
LigandPNGBDBM50398183(CHEMBL2182106)
Affinity DataIC50:  1.60E+3nM. Assay description: Inhibition of MAP kinase p38alpha assessed as phosphorylation of ATF-2
In DepthDetails ArticlePubMed