BDBM50398187 CHEMBL2182089
SMILES Fc1ccc(Nc2ccc3c(OCc4ccccc4C3=O)c2)cc1NC(=O)c1ccsc1
InChI Key InChIKey=PCUFFZVTCCWYNI-UHFFFAOYSA-N
Data  1 IC50
  Tab Delimited (TSV)   2D SDfile   Computed 3D by Vconf -m prep SDfile
Find this compound or compounds like it in BindingDB:
Activity Spreadsheet -- Enzyme Inhibition Constant Data from BindingDB
Found 1 hit for monomerid = 50398187
TargetMitogen-activated protein kinase 14(Homo sapiens (Human))
Eberhard Karls University T£Bingen
Curated by ChEMBL
LigandPNGBDBM50398187(CHEMBL2182089)
Affinity DataIC50:  10nM. Assay description: Inhibition of MAP kinase p38alpha assessed as phosphorylation of ATF-2
In DepthDetails ArticlePubMed