BDBM50398467 CHEMBL2179127
SMILES Fc1ccc(cc1)-c1[nH]c(nc1-c1ccnc2[nH]c3ccccc3c12)-c1ccccc1
InChI Key InChIKey=XFWCBRBLQAFBNF-UHFFFAOYSA-N
Data  1 IC50
  Tab Delimited (TSV)   2D SDfile   Computed 3D by Vconf -m prep SDfile
Find this compound or compounds like it in BindingDB:
Activity Spreadsheet -- Enzyme Inhibition Constant Data from BindingDB
Found 1 hit for monomerid = 50398467
TargetMitogen-activated protein kinase 14(Homo sapiens (Human))
University Of Tuebingen
Curated by ChEMBL
LigandPNGBDBM50398467(CHEMBL2179127)
Affinity DataIC50:  153nM. Assay description: Inhibition of p38alpha MAPK
In DepthDetails ArticlePubMed