BDBM50398633 CHEMBL2177495
SMILES N1c2ccccc2Oc2nc3ccccc3nc12
InChI Key InChIKey=DVVDOLPZDYBCBZ-UHFFFAOYSA-N
Data  1 IC50
  Tab Delimited (TSV)   2D SDfile   Computed 3D by Vconf -m prep SDfile
Find this compound or compounds like it in BindingDB:
Activity Spreadsheet -- Enzyme Inhibition Constant Data from BindingDB
Found 1 hit for monomerid = 50398633
TargetDihydroorotate dehydrogenase (quinone), mitochondrial(Homo sapiens (Human))
State Key Laboratory Of Bioreactor Engineering
Curated by ChEMBL
LigandPNGBDBM50398633(CHEMBL2177495)
Affinity DataIC50:  1.83E+4nM. Assay description: Inhibition of human DHODH expressed in Escherichia coli BL21(DE3) using L-dihydroorotate as substrate after 10 mins by DCIP dye reduction assay
In DepthDetails ArticlePubMed