BDBM50398785 CHEMBL2180016
SMILES CC1(N=C(N)C(=N1)c1ccccc1)c1cccc(c1)-c1cccnc1
InChI Key InChIKey=QCKWDUXMUOHHDA-UHFFFAOYSA-N
Data  1 IC50
  Tab Delimited (TSV)   2D SDfile   Computed 3D by Vconf -m prep SDfile
Find this compound or compounds like it in BindingDB:
Activity Spreadsheet -- Enzyme Inhibition Constant Data from BindingDB
Found 1 hit for monomerid = 50398785
TargetPotassium voltage-gated channel subfamily H member 2(Homo sapiens (Human))
Astrazeneca
Curated by ChEMBL
LigandPNGBDBM50398785(CHEMBL2180016)
Affinity DataIC50: >3.30E+4nM. Assay description: Inhibition of human ERG expressed in CHO cells by IonWorks assay
In DepthDetails ArticlePubMed