BDBM50398828 CHEMBL2177109
SMILES COc1ccccc1Oc1cncc(c1)C1=CC2CNCC(C2)C1
InChI Key InChIKey=TWVKXXKMLUVNDJ-UHFFFAOYSA-N
Data  2 KI
  Tab Delimited (TSV)   2D SDfile   Computed 3D by Vconf -m prep SDfile
Find this compound or compounds like it in BindingDB:
Activity Spreadsheet -- Enzyme Inhibition Constant Data from BindingDB
Found 2 hits for monomerid = 50398828
TargetNeuronal acetylcholine receptor subunit alpha-4/beta-2(Homo sapiens (Human))
Targacept
Curated by ChEMBL
LigandPNGBDBM50398828(CHEMBL2177109)
Affinity DataKi:  1nM. Assay description: Displacement of [3H]nicotine from human alpha4beta2 nAChR expressed in human SH-EP1 cells
In DepthDetails ArticlePubMed
TargetNeuronal acetylcholine receptor subunit alpha-7(Homo sapiens (Human))
Targacept
Curated by ChEMBL
LigandPNGBDBM50398828(CHEMBL2177109)
Affinity DataKi:  30nM. Assay description: Displacement of [3H]epibatidine from human alpha7 nAChR expressed in human HEK/RIC3 cells
In DepthDetails ArticlePubMed