BDBM50399261 CHEMBL2180537
SMILES CC(C)C(NC(=O)C(C)C)C(=O)N1CCC(CC1)c1ccc(Cl)cc1
InChI Key InChIKey=BLASTQMPHSPAPH-UHFFFAOYSA-N
Data  1 IC50
  Tab Delimited (TSV)   2D SDfile   Computed 3D by Vconf -m prep SDfile
Find this compound or compounds like it in BindingDB:
Activity Spreadsheet -- Enzyme Inhibition Constant Data from BindingDB
Found 1 hit for monomerid = 50399261
TargetC-C chemokine receptor type 1(Homo sapiens (Human))
Bristol-Myers Squibb
Curated by ChEMBL
LigandPNGBDBM50399261(CHEMBL2180537)
Affinity DataIC50:  388nM. Assay description: Displacement of [125I]MIP-1alpha from CCR1 in human THP1 cells
In DepthDetails ArticlePubMed