BDBM50399366 CHEMBL2178278
SMILES CN1CCN(Cc2ccc(NC(=O)c3ccc(Br)c(c3)-n3cc(nn3)-c3cnc4[nH]ncc4c3)cc2C(F)(F)F)CC1
InChI Key InChIKey=WHTDVCOWKCEOHS-UHFFFAOYSA-N
Data  1 IC50
  Tab Delimited (TSV)   2D SDfile   Computed 3D by Vconf -m prep SDfile
Find this compound or compounds like it in BindingDB:
Activity Spreadsheet -- Enzyme Inhibition Constant Data from BindingDB
Found 1 hit for monomerid = 50399366
TargetBreakpoint cluster region protein/Tyrosine-protein kinase ABL1(Homo sapiens (Human))
Chinese Academy Of Sciences
Curated by ChEMBL
LigandPNGBDBM50399366(CHEMBL2178278)
Affinity DataIC50:  0.700nM. Assay description: Inhibition of wild type Bcr-Abl using Tyr2 peptide as substrate after 2 hrs by FRET-based Z'-Lyte assay
In DepthDetails ArticlePubMed