BDBM50399451 CHEMBL2179404
SMILES CCCCCCCCCCCCCCCC(=O)OC[C@H](CSC[C@H](NC(=O)COCC(=O)NCCCOCCOCCOCCCNC(C)=O)C(=O)NCC(=O)N[C@@H](CO)C(=O)N[C@@H](CCC(N)=O)C(=O)N[C@@H](CC(N)=O)C(=O)N[C@@H](CC(C)C)C(=O)N[C@@H](C)C(=O)N[C@@H](CO)C(=O)N[C@@H](CC(C)C)C(=O)N[C@@H](CCC(O)=O)C(=O)N[C@@H](CCC(O)=O)C(N)=O)OC(=O)CCCCCCCCCCCCCCC
InChI Key InChIKey=JSOFPIQYUXLJLQ-GQYCUGLJSA-N
Data  1 EC50
  Tab Delimited (TSV)   2D SDfile   Computed 3D by Vconf -m prep SDfile
Find this compound or compounds like it in BindingDB:
Activity Spreadsheet -- Enzyme Inhibition Constant Data from BindingDB
Found 1 hit for monomerid = 50399451
TargetToll-like receptor 2(Homo sapiens (Human))
H. Lee Moffitt Cancer Center And Research Institute
Curated by ChEMBL
LigandPNGBDBM50399451(CHEMBL2179404)
Affinity DataEC50:  78nM. Assay description: Agonist activity at human TLR2 expressed in HEK293 cells assessed as induction of NF-kappaB signaling after 24 hrs by luminescence based luciferase r...
In DepthDetails ArticlePubMed