BDBM50399456 CHEMBL2179399
SMILES CCCCCCCCCCCCCCCC(=O)N[C@@H](CSC[C@@H](COC(=O)CCCCCCCCCCCCCCC)OC(=O)CCCCCCCCCCCCCCC)C(=O)N[C@@H](CO)C(=O)N[C@@H](CCCCN)C(=O)N[C@@H](CCCCN)C(=O)N[C@@H](CCCCN)C(=O)N[C@@H](CCCCN)C(O)=O
InChI Key InChIKey=OEDPHAKKZGDBEV-CQZJAECQSA-N
Data  2 EC50
  Tab Delimited (TSV)   2D SDfile   Computed 3D by Vconf -m prep SDfile
Find this compound or compounds like it in BindingDB:
Activity Spreadsheet -- Enzyme Inhibition Constant Data from BindingDB
Found 2 hits for monomerid = 50399456
TargetToll-like receptor 6(Homo sapiens)
Panjab University
Curated by ChEMBL
LigandPNGBDBM50399456(CHEMBL2179399)
Affinity DataEC50:  19nM. Assay description: Agonist activity at human TLR2/TLR6 expressed in HEK-Blue hTLR2-TLR6 cells by SEAP reporter gene based Quanti-blue assay
In DepthDetails PubMed
TargetToll-like receptor 2(Homo sapiens (Human))
H. Lee Moffitt Cancer Center And Research Institute
Curated by ChEMBL
LigandPNGBDBM50399456(CHEMBL2179399)
Affinity DataEC50:  23nM. Assay description: Agonist activity at human TLR2 expressed in HEK293 cells assessed as induction of NF-kappaB signaling after 24 hrs by luminescence based luciferase r...
In DepthDetails ArticlePubMed