BDBM50399708 CHEMBL2178382
SMILES NC(=N)c1cncc(n1)-c1ccc(cc1)[C@H]1CC[C@H](CC(O)=O)CC1
InChI Key InChIKey=MILPMQNFJAVVSJ-JOCQHMNTSA-N
Data  1 IC50
  Tab Delimited (TSV)   2D SDfile   Computed 3D by Vconf -m prep SDfile
Find this compound or compounds like it in BindingDB:
Activity Spreadsheet -- Enzyme Inhibition Constant Data from BindingDB
Found 1 hit for monomerid = 50399708
TargetDiacylglycerol O-acyltransferase 1(Homo sapiens (Human))
Astrazeneca
Curated by ChEMBL
LigandPNGBDBM50399708(CHEMBL2178382)
Affinity DataIC50: >3.30E+4nM. Assay description: Inhibition of human recombinant DGAT1 expressed in Sf9 cells by liquid scintillography
In DepthDetails ArticlePubMed