BDBM50399833 CHEMBL2180271
SMILES COC(=O)C1C(C2=C(CC(CC2=O)c2ccccc2)N=C1C)c1ccc(cc1)-c1ccccc1
InChI Key InChIKey=MYMJLYQYEVTLRD-UHFFFAOYSA-N
Data  1 IC50
  Tab Delimited (TSV)   2D SDfile   Computed 3D by Vconf -m prep SDfile
Find this compound or compounds like it in BindingDB:
Activity Spreadsheet -- Enzyme Inhibition Constant Data from BindingDB
Found 1 hit for monomerid = 50399833
TargetTGF-beta receptor type-2(Homo sapiens (Human))
Human Biomolecular Research Institute
Curated by ChEMBL
LigandPNGBDBM50399833(CHEMBL2180271)
Affinity DataIC50:  1.92E+3nM. Assay description: Inhibition of TGBR2 signaling in human HEK293T cells assessed as inhibition of SMAD activation after 2 to 22 hrs by dual Luciferase Assay
In DepthDetails ArticlePubMed