BDBM50399858 CHEMBL2180289
SMILES COC(=O)C1=C(C)N=C2CC(C)(C)CC(=O)C2C1c1ccc(cc1)-n1cccn1
InChI Key InChIKey=GZEPAROILGPPOL-UHFFFAOYSA-N
Data  1 IC50
  Tab Delimited (TSV)   2D SDfile   Computed 3D by Vconf -m prep SDfile
Find this compound or compounds like it in BindingDB:
Activity Spreadsheet -- Enzyme Inhibition Constant Data from BindingDB
Found 1 hit for monomerid = 50399858
TargetTGF-beta receptor type-2(Homo sapiens (Human))
Human Biomolecular Research Institute
Curated by ChEMBL
LigandPNGBDBM50399858(CHEMBL2180289)
Affinity DataIC50:  8.80E+3nM. Assay description: Inhibition of TGBR2 signaling in human HEK293T cells assessed as inhibition of SMAD activation after 2 to 22 hrs by dual Luciferase Assay
In DepthDetails ArticlePubMed