BDBM50399937 CHEMBL2181241
SMILES CN(C)c1ccccc1N(C)C(=O)c1cncnc1Oc1cc(Cl)ccc1Cl
InChI Key InChIKey=IULFHMMKRLZFHZ-UHFFFAOYSA-N
Data  1 EC50
  Tab Delimited (TSV)   2D SDfile   Computed 3D by Vconf -m prep SDfile
Find this compound or compounds like it in BindingDB:
Activity Spreadsheet -- Enzyme Inhibition Constant Data from BindingDB
Found 1 hit for monomerid = 50399937
TargetG-protein coupled bile acid receptor 1(Homo sapiens (Human))
Chinese Academy Of Sciences
Curated by ChEMBL
LigandPNGBDBM50399937(CHEMBL2181241)
Affinity DataEC50:  3.71E+3nM. Assay description: Agonist activity at human TGR5 expressed in HEK293 cells incubated for 5.5 hrs by CRE-driven luciferase reporter gene assay
In DepthDetails ArticlePubMed