BDBM50399940 CHEMBL2181257
SMILES CCCCN1CCN(C(=O)c2cncnc2Oc2cc(Cl)ccc2Cl)c2ccccc12
InChI Key InChIKey=UQBGTZFHMRHWLQ-UHFFFAOYSA-N
Data  1 EC50
  Tab Delimited (TSV)   2D SDfile   Computed 3D by Vconf -m prep SDfile
Find this compound or compounds like it in BindingDB:
Activity Spreadsheet -- Enzyme Inhibition Constant Data from BindingDB
Found 1 hit for monomerid = 50399940
TargetG-protein coupled bile acid receptor 1(Homo sapiens (Human))
Chinese Academy Of Sciences
Curated by ChEMBL
LigandPNGBDBM50399940(CHEMBL2181257)
Affinity DataEC50:  590nM. Assay description: Agonist activity at human TGR5 expressed in HEK293 cells incubated for 5.5 hrs by CRE-driven luciferase reporter gene assay
In DepthDetails ArticlePubMed