BDBM50399953 CHEMBL2181240
SMILES Clc1ccc(Cl)c(Oc2ccncc2C(=O)N2CCN(C3CCC3)c3ccccc23)c1
InChI Key InChIKey=MTODFZWWDNJEKP-UHFFFAOYSA-N
Data  2 EC50
  Tab Delimited (TSV)   2D SDfile   Computed 3D by Vconf -m prep SDfile
Find this compound or compounds like it in BindingDB:
Activity Spreadsheet -- Enzyme Inhibition Constant Data from BindingDB
Found 2 hits for monomerid = 50399953
TargetG-protein coupled bile acid receptor 1(Homo sapiens (Human))
Chinese Academy Of Sciences
Curated by ChEMBL
LigandPNGBDBM50399953(CHEMBL2181240)
Affinity DataEC50:  2.80nM. Assay description: Agonist activity at human TGR5 expressed in HEK293 cells incubated for 5.5 hrs by CRE-driven luciferase reporter gene assay
In DepthDetails ArticlePubMed
TargetG-protein coupled bile acid receptor 1(Mus musculus)
Chinese Academy Of Sciences
Curated by ChEMBL
LigandPNGBDBM50399953(CHEMBL2181240)
Affinity DataEC50:  31nM. Assay description: Agonist activity at mouse TGR5 expressed in HEK293 cells incubated for 5.5 hrs by CRE-driven luciferase reporter gene assay
In DepthDetails ArticlePubMed