BDBM50399993 CHEMBL2181457
SMILES CC1(C)[C@@H]2C[C@H]1C(C[N+](C)(C)Cc1ccc(cc1)-c1cccc(Cl)c1)=CC2
InChI Key InChIKey=CCPSKGNIXBUQQY-UPVQGACJSA-N
Data  3 KI
  Tab Delimited (TSV)   2D SDfile   Computed 3D by Vconf -m prep SDfile
Find this compound or compounds like it in BindingDB:
Activity Spreadsheet -- Enzyme Inhibition Constant Data from BindingDB
Found 3 hits for monomerid = 50399993
TargetC-X-C chemokine receptor type 3(Homo sapiens (Human))
Vu University Amsterdam
Curated by ChEMBL
LigandPNGBDBM50399993(CHEMBL2181457)
Affinity DataKi:  126nM. Assay description: Displacement of [125I]-CXCL10 from human CXCR3 expressed in HEK293 cells
In DepthDetails ArticlePubMed
TargetC-X-C chemokine receptor type 3(Homo sapiens (Human))
Vu University Amsterdam
Curated by ChEMBL
LigandPNGBDBM50399993(CHEMBL2181457)
Affinity DataKi:  251nM. Assay description: Displacement of [125I]CXCL10 from CXCR3 expressed in HEK293 cells
In DepthDetails ArticlePubMed
TargetC-X-C chemokine receptor type 3(Homo sapiens (Human))
Vu University Amsterdam
Curated by ChEMBL
LigandPNGBDBM50399993(CHEMBL2181457)
Affinity DataKi:  316nM. Assay description: Displacement of [125I]-CXCL11 from human CXCR3 expressed in HEK293 cells
In DepthDetails ArticlePubMed