BDBM50400163 CHEMBL2179439
SMILES CN(C)C(=O)CNc1ncc(C(=O)N[C@H]2C3CC4CC2C[C@](O)(C4)C3)c(n1)C1CCCC1
InChI Key InChIKey=LXCOLPFHGLYORA-AKSATJCXSA-N
Data  2 IC50
  Tab Delimited (TSV)   2D SDfile   Computed 3D by Vconf -m prep SDfile
Find this compound or compounds like it in BindingDB:
Activity Spreadsheet -- Enzyme Inhibition Constant Data from BindingDB
Found 2 hits for monomerid = 50400163
Target11-beta-hydroxysteroid dehydrogenase 1(Homo sapiens (Human))
Astrazeneca
Curated by ChEMBL
LigandPNGBDBM50400163(CHEMBL2179439)
Affinity DataIC50:  45nM. Assay description: Inhibition of human 11beta-HSD1 by HTRF assay
In DepthDetails ArticlePubMed
Target11-beta-hydroxysteroid dehydrogenase 1(Mus musculus (mouse))
Astrazeneca
Curated by ChEMBL
LigandPNGBDBM50400163(CHEMBL2179439)
Affinity DataIC50:  163nM. Assay description: Inhibition of mouse 11beta-HSD1 by HTRF assay
In DepthDetails ArticlePubMed