BDBM50400184 CHEMBL192032
SMILES Oc1cc2C(=O)c3ccccc3C(=O)c2c(O)c1O
InChI Key InChIKey=AHKDJQYHVWSRLT-UHFFFAOYSA-N
Data  4 KI
  Tab Delimited (TSV)   2D SDfile   Computed 3D by Vconf -m prep SDfile
Find this compound or compounds like it in BindingDB:
Activity Spreadsheet -- Enzyme Inhibition Constant Data from BindingDB
Found 4 hits for monomerid = 50400184
TargetInduced myeloid leukemia cell differentiation protein Mcl-1(Homo sapiens (Human))
Dalian University Of Technology
Curated by ChEMBL
LigandPNGBDBM50400184(CHEMBL192032)
Affinity DataKi:  270nM. Assay description: Binding affinity to Mcl-1 after 30 mins by florescence polarization assay
In DepthDetails ArticlePubMed
TargetApoptosis regulator Bcl-2(Homo sapiens (Human))
Dalian University Of Technology
Curated by ChEMBL
LigandPNGBDBM50400184(CHEMBL192032)
Affinity DataKi:  583nM. Assay description: Binding affinity to Bcl-2 after 30 mins by florescence polarization assay
In DepthDetails ArticlePubMed
TargetInduced myeloid leukemia cell differentiation protein Mcl-1(Homo sapiens (Human))
Dalian University Of Technology
Curated by ChEMBL
LigandPNGBDBM50400184(CHEMBL192032)
Affinity DataKi:  1.21E+3nM. Assay description: Displacement of FAM-Bid BH3 peptide from recombinant Mcl-1 (unknown origin) expressed in Escherichia coli BL21 after 10 mins by fluorescence polariza...
In DepthDetails ArticlePubMed
TargetApoptosis regulator Bcl-2(Homo sapiens (Human))
Dalian University Of Technology
Curated by ChEMBL
LigandPNGBDBM50400184(CHEMBL192032)
Affinity DataKi:  1.33E+3nM. Assay description: Displacement of FAM-Bid BH3 peptide from recombinant Bcl-2 (unknown origin) expressed in Escherichia coli BL21 after 10 mins by fluorescence polariza...
In DepthDetails ArticlePubMed