BDBM50400363 CHEMBL2181673
SMILES CC(C)(C)OC(=O)N1CCC2(CCN(CC2)C(=O)Nc2ccc(cc2Br)S(C)(=O)=O)CC1
InChI Key InChIKey=OGGSMYNGPMPXSQ-UHFFFAOYSA-N
Data  1 EC50
  Tab Delimited (TSV)   2D SDfile   Computed 3D by Vconf -m prep SDfile
Find this compound or compounds like it in BindingDB:
Activity Spreadsheet -- Enzyme Inhibition Constant Data from BindingDB
Found 1 hit for monomerid = 50400363
TargetGlucose-dependent insulinotropic receptor(Homo sapiens (Human))
Boehringer Ingelheim Pharma
Curated by ChEMBL
LigandPNGBDBM50400363(CHEMBL2181673)
Affinity DataEC50:  800nM. Assay description: Agonist activity at human GPR119 expressed in MIN6 cells assessed as intracellular cAMP level after 45 mins by ALPHAscreen cAMP assay
In DepthDetails ArticlePubMed