BDBM50400474 CHEMBL2178504
SMILES Cc1cn([C@@H]2C[C@H](O)[C@@H](CNC(=O)Nc3cccc(Cl)c3)O2)c(=O)[nH]c1=O
InChI Key InChIKey=FHDHQCICISNLFS-MJBXVCDLSA-N
Data  1 KI
  Tab Delimited (TSV)   2D SDfile   Computed 3D by Vconf -m prep SDfile
Find this compound or compounds like it in BindingDB:
Activity Spreadsheet -- Enzyme Inhibition Constant Data from BindingDB
Found 1 hit for monomerid = 50400474
TargetdTMP kinase(Plasmodium falciparum (isolate 3D7))
University Of Dundee
Curated by ChEMBL
LigandPNGBDBM50400474(CHEMBL2178504)
Affinity DataKi:  1.06E+5nM. Assay description: Inhibition of recombinant Plasmodium falciparum TMPK using TMP as substrate by pyruvate kinase and lactate dehydrogenase enzyme coupled assay
In DepthDetails ArticlePubMed