BDBM50400527 CHEMBL2204936
SMILES Cc1nc(no1)[C@]1(N[C@H](Cc2c1[nH]c1ccccc21)c1nc(c[nH]1)-c1ccc(F)cc1)c1cnn(C)c1
InChI Key InChIKey=NTIFDLOQPKMIJK-AMGIVPHBSA-N
Data  1 KI  4 IC50
  Tab Delimited (TSV)   2D SDfile   Computed 3D by Vconf -m prep SDfile
Find this compound or compounds like it in BindingDB:
Activity Spreadsheet -- Enzyme Inhibition Constant Data from BindingDB
Found 5 hits for monomerid = 50400527
TargetPotassium voltage-gated channel subfamily H member 2(Homo sapiens (Human))
TBA
Curated by ChEMBL
LigandPNGBDBM50400527(CHEMBL2204936)
Affinity DataKi:  1.64E+3nM. Assay description: Displacement of radiolabeled MK-499 from human ERG channel
In DepthDetails ArticlePubMed
TargetSomatostatin receptor type 3(MOUSE)
TBA
Curated by ChEMBL
LigandPNGBDBM50400527(CHEMBL2204936)
Affinity DataIC50:  3.70nM. Assay description: Inhibition of mouse SSTR3 transfected in CHO cells assessed as inhibition of SRIF-induced reduction of cAMP accumulation after 45 mins
In DepthDetails ArticlePubMed
TargetSomatostatin receptor type 3(Homo sapiens (Human))
TBA
Curated by ChEMBL
LigandPNGBDBM50400527(CHEMBL2204936)
Affinity DataIC50:  1.10nM. Assay description: Displacement of [125I]SS-28 from human SSTR3 transfected in CHO cells after 60 to 90 mins
In DepthDetails ArticlePubMed
TargetSomatostatin receptor type 3(MOUSE)
TBA
Curated by ChEMBL
LigandPNGBDBM50400527(CHEMBL2204936)
Affinity DataIC50:  0.610nM. Assay description: Displacement of [125I]SS-28 from mouse SSTR3 transfected in CHO cells after 60 to 90 mins
In DepthDetails ArticlePubMed
TargetSomatostatin receptor type 3(Homo sapiens (Human))
TBA
Curated by ChEMBL
LigandPNGBDBM50400527(CHEMBL2204936)
Affinity DataIC50:  1.10nM. Assay description: Inhibition of human SSTR3 transfected in CHO cells assessed as inhibition of SRIF-induced reduction of cAMP accumulation after 45 mins
In DepthDetails ArticlePubMed