BDBM50400555 CHEMBL2204966
SMILES CC(C)C[C@H](NC(=O)NCCCCc1ccccc1)C(=O)NO
InChI Key InChIKey=GBTDMMOIQRIWPQ-HNNXBMFYSA-N
Data  1 IC50
  Tab Delimited (TSV)   2D SDfile   Computed 3D by Vconf -m prep SDfile
Find this compound or compounds like it in BindingDB:
Activity Spreadsheet -- Enzyme Inhibition Constant Data from BindingDB
Found 1 hit for monomerid = 50400555
TargetAminopeptidase N(Sus scrofa (Pig))
TBA
Curated by ChEMBL
LigandPNGBDBM50400555(CHEMBL2204966)
Affinity DataIC50:  2.30E+3nM. Assay description: Inhibition of APN in porcine kidney microsome assessed as inhibition of L-Leu-p-nitroanilide substrate hydrolysis incubated for 5 mins before substra...
In DepthDetails ArticlePubMed