BDBM50400677 CHEMBL2203535
SMILES O=c1[nH]c2ccccc2nc1-c1ccccc1NCc1ccccc1
InChI Key InChIKey=CZCLEQLRICNVOO-UHFFFAOYSA-N
Data  1 IC50
  Tab Delimited (TSV)   2D SDfile   Computed 3D by Vconf -m prep SDfile
Find this compound or compounds like it in BindingDB:
Activity Spreadsheet -- Enzyme Inhibition Constant Data from BindingDB
Found 1 hit for monomerid = 50400677
TargetSerine/threonine-protein kinase 33(Homo sapiens (Human))
TBA
Curated by ChEMBL
LigandPNGBDBM50400677(CHEMBL2203535)
Affinity DataIC50: >1.00E+4nM. Assay description: Inhibition of N-terminal 6His-tagged full length human recombinant STK33 using myelin basic protein as substrate incubated for 15 mins before initiat...
In DepthDetails ArticlePubMed