BDBM50400733 CHEMBL2203548
SMILES Clc1cccc(-c2ccc(\C=C3/C(=O)NC(=S)N(CC=C)C3=O)o2)c1Cl
InChI Key InChIKey=NASLGRREAVKNNT-FMIVXFBMSA-N
Data  6 IC50
  Tab Delimited (TSV)   2D SDfile   Computed 3D by Vconf -m prep SDfile
Find this compound or compounds like it in BindingDB:
Activity Spreadsheet -- Enzyme Inhibition Constant Data from BindingDB
Found 6 hits for monomerid = 50400733
TargetNAD-dependent protein deacetylase sirtuin-2(Homo sapiens (Human))
TBA
Curated by ChEMBL
LigandPNGBDBM50400733(CHEMBL2203548)
Affinity DataIC50:  9.70E+3nM. Assay description: Inhibition of recombinant SIRT2 using ZMAL substrate after 4 hrs by homogeneous fluorescence assay
In DepthDetails ArticlePubMed
TargetNAD-dependent protein deacetylase sirtuin-1(Homo sapiens (Human))
TBA
Curated by ChEMBL
LigandPNGBDBM50400733(CHEMBL2203548)
Affinity DataIC50:  5.30E+3nM. Assay description: Inhibition of recombinant SIRT1 using ZMAL substrate after 4 hrs by homogeneous fluorescence assay
In DepthDetails ArticlePubMed
TargetNAD-dependent protein deacetylase sirtuin-2(Homo sapiens (Human))
TBA
Curated by ChEMBL
LigandPNGBDBM50400733(CHEMBL2203548)
Affinity DataIC50:  1.00E+4nM. Assay description: Inhibition of sirtuin 2 (unknown origin)
In DepthDetails ArticlePubMed
TargetNAD-dependent protein deacylase sirtuin-5, mitochondrial(Homo sapiens (Human))
Martin-Luther-University Halle-Wittenberg
Curated by ChEMBL
LigandPNGBDBM50400733(CHEMBL2203548)
Affinity DataIC50:  2.52E+4nM. Assay description: Inhibition of human recombinant N-terminal Strep2-tagged SIRT5 expressed in Escherichia coli BL21 (DE3) using Abz-GVLK(glutaryl)AY(NO2)GV-NH2 as subs...
In DepthDetails ArticlePubMed
TargetNAD-dependent protein deacetylase sirtuin-1(Homo sapiens (Human))
TBA
Curated by ChEMBL
LigandPNGBDBM50400733(CHEMBL2203548)
Affinity DataIC50:  5.00E+3nM. Assay description: Inhibition of sirtuin 1 (unknown origin)
In DepthDetails ArticlePubMed
TargetNAD-dependent protein deacylase sirtuin-5, mitochondrial(Homo sapiens (Human))
Martin-Luther-University Halle-Wittenberg
Curated by ChEMBL
LigandPNGBDBM50400733(CHEMBL2203548)
Affinity DataIC50:  2.30E+3nM. Assay description: Inhibition of SIRT5 using ZK(suc)A substrate after 1 hr by homogeneous fluorescence assay
In DepthDetails ArticlePubMed