BDBM50400849 CHEMBL2203634
SMILES CCCCCCCCC1(Cc2ccccc2)C(=O)NC(=O)NC1=O
InChI Key InChIKey=MWKXYRJSVHPPLM-UHFFFAOYSA-N
Data  6 IC50
  Tab Delimited (TSV)   2D SDfile   Computed 3D by Vconf -m prep SDfile
Find this compound or compounds like it in BindingDB:
Activity Spreadsheet -- Enzyme Inhibition Constant Data from BindingDB
Found 6 hits for monomerid = 50400849
TargetMatrix metalloproteinase-9(Homo sapiens (Human))
Bristol-Myers Squibb Pharmaceutical Research And Development
Curated by ChEMBL
LigandPNGBDBM50400849(CHEMBL2203634)
Affinity DataIC50:  1nM. Assay description: Inhibition of MMP9
In DepthDetails ArticlePubMed
TargetMatrix metalloproteinase-9(Homo sapiens (Human))
Bristol-Myers Squibb Pharmaceutical Research And Development
Curated by ChEMBL
LigandPNGBDBM50400849(CHEMBL2203634)
Affinity DataIC50:  1nM. Assay description: Inhibition of MMP9 (unknown origin)
In DepthDetails ArticlePubMed
TargetCollagenase 3(Homo sapiens (Human))
Westf£Lische Wilhelms-Universit£T M£Nster
Curated by ChEMBL
LigandPNGBDBM50400849(CHEMBL2203634)
Affinity DataIC50:  214nM. Assay description: Inhibition of human active MMP13 using (7-methoxycoumarin-4-yl)acetyl-Pro-Leu-Gly-Leu-(3-(2,4-dinitrophenyl)-L-2,3-diamino-propionyl)Ala-Arg-NH2 as s...
In DepthDetails ArticlePubMed
TargetNeutrophil collagenase(Homo sapiens (Human))
Westf£Lische Wilhelms-Universit£T M£Nster
Curated by ChEMBL
LigandPNGBDBM50400849(CHEMBL2203634)
Affinity DataIC50:  157nM. Assay description: Inhibition of human active MMP8 using (7-methoxycoumarin-4-yl)acetyl-Pro-Leu-Gly-Leu-(3-(2,4-dinitrophenyl)-L-2,3-diamino-propionyl)Ala-Arg-NH2 as su...
In DepthDetails ArticlePubMed
TargetMatrix metalloproteinase-9(Homo sapiens (Human))
Bristol-Myers Squibb Pharmaceutical Research And Development
Curated by ChEMBL
LigandPNGBDBM50400849(CHEMBL2203634)
Affinity DataIC50:  22nM. Assay description: Inhibition of human active MMP9 using (7-methoxycoumarin-4-yl)acetyl-Pro-Leu-Gly-Leu-(3-(2,4-dinitrophenyl)-L-2,3-diamino-propionyl)Ala-Arg-NH2 as su...
In DepthDetails ArticlePubMed
Target72 kDa type IV collagenase(Homo sapiens (Human))
Westf£Lische Wilhelms-Universit£T M£Nster
Curated by ChEMBL
LigandPNGBDBM50400849(CHEMBL2203634)
Affinity DataIC50:  288nM. Assay description: Inhibition of human active MMP2 using (7-methoxycoumarin-4-yl)acetyl-Pro-Leu-Gly-Leu-(3-(2,4-dinitrophenyl)-L-2,3-diamino-propionyl)Ala-Arg-NH2 as su...
In DepthDetails ArticlePubMed