BDBM50401000 CHEMBL2206282
SMILES CCN(Cc1ccncc1)C(=O)Cn1c2nc(ncc2n(C)c1=O)-c1ccccc1
InChI Key InChIKey=DVZHRCBQTQUFHQ-UHFFFAOYSA-N
Data  1 KI
  Tab Delimited (TSV)   2D SDfile   Computed 3D by Vconf -m prep SDfile
Find this compound or compounds like it in BindingDB:
Activity Spreadsheet -- Enzyme Inhibition Constant Data from BindingDB
Found 1 hit for monomerid = 50401000
TargetTranslocator protein(Rattus norvegicus (rat))
National Institute Of Radiological Sciences
Curated by ChEMBL
LigandPNGBDBM50401000(CHEMBL2206282)
Affinity DataKi:  5.10nM. Assay description: Displacement of [11C]-PK-11195 from TPSO in Sprague-Dawley rat brain homogenate after 30 mins by gamma counting
In DepthDetails ArticlePubMed