BDBM50401386 CHEMBL2206446
SMILES COc1ccc(F)c(F)c1C1CCN(CC1)c1ccn2c(CC3CC3)nnc2c1Cl
InChI Key InChIKey=JCAXAUNEKJYCFA-UHFFFAOYSA-N
Data  1 IC50  1 EC50
  Tab Delimited (TSV)   2D SDfile   Computed 3D by Vconf -m prep SDfile
Find this compound or compounds like it in BindingDB:
Activity Spreadsheet -- Enzyme Inhibition Constant Data from BindingDB
Found 2 hits for monomerid = 50401386
TargetMetabotropic glutamate receptor 2(Homo sapiens (Human))
Janssen-Cilag
Curated by ChEMBL
LigandPNGBDBM50401386(CHEMBL2206446)
Affinity DataEC50:  9.30nM. Assay description: Agonist activity at human mGLuR2 expressed in CHO cell membrane assessed as [32S]GTPgammaS after 30 mins by scintillation counting
In DepthDetails ArticlePubMed
TargetMetabotropic glutamate receptor 2(Homo sapiens (Human))
Janssen-Cilag
Curated by ChEMBL
LigandPNGBDBM50401386(CHEMBL2206446)
Affinity DataIC50:  7.30nM. Assay description: Displacement of [3H]JNJ-40068782 from human mGLuR2 expressed in CHO cell membrane after 60 mins by liquid scintillation counting
In DepthDetails ArticlePubMed